{"text_format":"1","workbook":"xlsx","n_sheets":4,"sheets":["Margenkalk","Matrix","Precalculation","Interne Li-Kosten"],"not_rendered":{"charts":0,"images":1,"macros":1,"external_links":6,"defined_names":2,"comments":2,"pivot_tables":0},"unopened":[],"bounds":{"document_bytes":16777216,"sheet_cells":100000,"rows_first":2000,"rows_last":500,"rows_between":2000,"halvings":0,"cell_chars":16384,"cell_head_chars":4096},"cells_cut":0,"cells_raw":0,"read":"whole","date_system":"1900"}

{"sheet":"Margenkalk","index":0,"n_rows":42,"n_cols":3,"rows_kept":42,"cut":false,"hidden":false,"merged":[[37,1,37,2],[31,1,31,2],[35,1,35,2],[21,1,21,2],[1,1,1,2],[3,1,3,2],[4,1,4,2],[22,1,22,2],[2,1,2,2]]}
[]
[null,"MARGENKALKULATOR"]
[null,"für WSD-Leasing und Eigengeschäft"]
[null,"Dient nur zum internen Gebrauch und darf keinesfalls an Kunden,"]
[null,"Kooperationspartner oder sonstige Dritte weitergegeben werden"]
[]
[null,{"$f":"CONCATENATE(\"Li-Kosten lt.: \",'Interne Li-Kosten'!$A$1)","v":"Li-Kosten lt.: Liqui-Aufschläge 01/2025"}]
[null,{"$f":"CONCATENATE(\"Risiko- und Unterlegungskosten lt.: \",Precalculation!B5)","v":"Risiko- und Unterlegungskosten lt.: Precalculation_201401"}]
[null,{"$f":"IF(C10>Matrix!K19,\"ACHTUNG KSV-Rating über 450 ist nicht akzeptabel!\",IF(C16>120,\"Laufzeit > 120 nicht möglich! Rücksprache mit Produktmanagement.\",IF(Matrix!E19=0,\"Bitte KSV-Rating, Bonitätseinschätzung oder Bonität erfassen!\",IF(Matrix!E20=\"\",\"Bitte Anschaffungswert erfassen!\",IF(C16=\"\",\"Bitte Laufzeit erfassen!\",IF(Matrix!L4=1,\"Bitte Objektsicherheit erfassen!\",IF(C28=\"\",\"Zur Ermittlung des Zinssatzes bitte Basiszinssatz erfassen!\",\"\")))))))","v":"Bitte KSV-Rating, Bonitätseinschätzung oder Bonität erfassen!"}]
[null,"KSV-Rating"]
[null,"Bonitätseinschätzung:"]
[null,"Bonität:"]
[]
[null,"Produkt:"]
[null,"Anschaffungswert exkl. USt.:"]
[null,"Laufzeit in Monaten:"]
[null,{"$f":"IF(Matrix!I22=3,\"Erhöhung erste Rate:\",\"Sonderentgeltvorauszahlung exkl. USt:\")","v":"Sonderentgeltvorauszahlung exkl. USt:"}]
[null,{"$f":"IF(Matrix!I22=2,\"Kaution feststehend:\",\"\")","v":""}]
[null,"Finanzierungsvolumen exkl. USt.:",{"$f":"IF(C15=\"\",\"\",C15-C17-C18)","v":""}]
[null,{"$f":"IF(Matrix!I22=3,\"Erhöhung letzte Rate:\",IF(Matrix!I22=1,IF(C33=\"\",\"\",CONCATENATE(\"Restwert exkl. USt.:                                                     \",ROUND(Matrix!H19,2))),\"Restwert exkl. USt.:\"))","v":""}]
[null,"Objektsicherheit in %:"]
[null,"Bei Objekten mit unterschiedl. Besicherung bitte nach Volumen der Einzelobjekte gewichten und den nächstgelegenen Wert auswählen!"]
[]
[null,"interne Li-Kosten inkl. Verw.-A:",{"$f":"IF(B9=\"\",ROUND(VLOOKUP(C16,'Interne Li-Kosten'!E5:G185,3,FALSE)/10000,5),\"\")","v":""}]
[null,"Risiko- und Unterlegungskosten: ",{"$f":"IF(B9=\"\",ROUND(VLOOKUP(Matrix!E22,Matrix!D31:Q222,Matrix!E4+4,FALSE)/100,5),\"\")","v":""}]
[null,"Gewinnbedarf lt. Geschäftsführung:",{"$f":"IF(B9=\"\",ROUND(Matrix!E23/100,5),\"\")","v":""}]
[null,"Aufschlag:",{"$f":"IF(B9=\"\",ROUND(C24+C25+C26,5),\"\")","v":""}]
[null,"Basiszinssatz:"]
[null,"Zinssatz:",{"$f":"IF(B9=\"\",IF(C28=\"\",\"\",C28+C27),\"\")","v":""}]
[]
[]
[null,"Ermittlung Konditionenpouvoir"]
[null,"Zinssatz für Kundenoffert:"]
[null,{"$f":"IF(C33=\"\",IF(B9=\"\",CONCATENATE(\"Für Pouvoirermittlung bitte \",B33,\" erfassen!\"),\"\"),CONCATENATE(\"Aufschlag für Kundenoffert:                              \",ROUND((C33-C28)*100,3),\"%\"))","v":""}]
[]
[null,{"$f":"IF(C33=\"\",\"\",IF(Matrix!O25=\"VI\",IF(C19>99999.99,\"Pouvoir VI/ACM. Keine Freizeichnung notwendig.\",\"Pouvoir VI. Keine Freizeichnung notwendig.\"),CONCATENATE(\"Freizeichnung \",Matrix!O25,\":_____\")))","v":""}]
[]
[null,"DB-Berechnung"]
[null,"DB Bearbeitungsgebühr:"]
[null,"DB Zinsmarge:",{"$f":"IF(CONCATENATE(B9,B42)=\"\",(C19+IF(Matrix!I22=1,Matrix!H19,C20)-C18)/2*(C33-C28-C24)/12*C16,\"\")","v":""}]
{"$rows_left_out":3}
{"sheet":"Matrix","index":1,"n_rows":222,"n_cols":17,"rows_kept":222,"cut":false,"hidden":true,"merged":[[10,8,10,10],[3,0,4,1],[2,14,2,15],[2,11,2,13],[2,8,2,10],[2,6,2,7],[2,3,2,5]]}
[]
[]
[null,null,null,"Laufzeit",null,null,"Bonität",null,"Bonitätseinschätzung",null,null,"Besicherung",null,null,"Gewinnbedarf"]
["Liquiditätsaufschlags-Matrix",null,null,{"$f":"ROUNDUP(Margenkalk!C16/12,0)","v":0},{"$f":"VLOOKUP(D4,D5:F14,3,FALSE)","v":{"$error":"#N/A"}},null,1,{"$f":"VLOOKUP(G4,G5:H17,2,FALSE)","v":0},1,{"$f":"VLOOKUP(I4,I5:K10,3,FALSE)","v":0},null,1,{"$f":"VLOOKUP(L4,L5:N9,3,FALSE)","v":0},null,1,0.7]
[null,null,null,1,"2 Jahre",2,1,null,1,null,null,1,null,null,2,0.7]
["Laufzeit","Finanzierung tilgend/",null,2,"2 Jahre",2,2,1,2,"kommunal (1-2)",2,2,0,0,3,0.8]
["in Jahren","Pauschalrate",null,3,"3 Jahre",3,3,2,3,"gut (3-4b)","4b",3,0.2,20,"4a",0.8]
[1,0,null,4,"4 Jahre",4,4,3,4,"mittel (4c-5b)","5b",4,0.5,50,"4b",0.8]
[2,0.02,null,5,"5 Jahre",5,5,"4a",5,"noch akzeptabel (5c-6b)","6b",5,0.7,70,"4c",0.6]
[3,0.04,null,6,"6 Jahre",6,6,"4b",null,null,null,null,null,null,"5a",0.6]
[4,0.05,null,7,"7 Jahre",7,7,"4c","KSV-Rating",null,null,null,null,null,"5b",0.6]
[5,7.0000000000000007E-2,null,8,"8 Jahre",8,8,"5a","Rating",{"$f":"Margenkalk!C10","v":0},{"$f":"IF(J12=\"\",0,IF(J12=0,0,IF(J12<J15,\"4b\",IF(J12<J16,\"4c\",IF(J12<J17,\"5a\",IF(J12<J18,\"5b\",IF(J12<J19,\"5c\",IF(J12<(K19+1),\"6b\",0))))))))","v":0},null,null,null,"5c",0.4]
[6,0.09,null,9,"9 Jahre",9,9,"5b","kommunal (1-2)",null,null,null,null,null,"6a",0.4]
[7,0.11,null,10,"10 Jahre",10,10,"5c","gut (3-4b)",100,200,null,null,null,"6b",0.4]
[8,0.12,null,null,null,null,11,"6a","mittel 4c",201,250,null,null,null,"zusätzlich bis TEUR 25",0.5]
[9,0.14000000000000001,null,null,null,null,12,"6b","mittel 5a",251,300,null,null,null,"zusätzlich TEUR 25 - 50",0.25]
[10,0.16,null,null,null,null,null,null,"mittel 5b",301,350]
[11,0.18,null,null,null,null,null,null,"noch akzeptabel 5c",351,400]
[12,0.19,null,"Bonität",{"$f":"IF(H4=0,IF(J4=0,K12,J4),H4)","v":0},null,"RWbeiFPO:",{"$f":"IF(Margenkalk!B9=\"\",IF(Margenkalk!C33=\"\",\"\",PMT(Margenkalk!C33/12,Margenkalk!C16+1,-Margenkalk!C15+Margenkalk!C17,0,K22)),\"\")","v":""},"noch akzeptabel 6a-6b",401,450]
[13,0.21,null,"Volmen",{"$f":"IF(Margenkalk!C19=\"\",\"\",IF(Margenkalk!C19<30000.01,\"k\",IF(Margenkalk!C19>200000,\"g\",\"m\")))","v":""},null,null,null,null,null,null,null,null,"Pouvoir","Nachlass","Gewinnbedarf"]
[14,0.23,null,"Besicherung",{"$f":"M4","v":0},null,null,null,"Produkt","VS/NS",null,null,null,"VI",0,{"$f":"E23-(E23*O21)","v":{"$error":"#N/A"}}]
[15,0.25,null,"Schlüssel",{"$f":"CONCATENATE(E19,E20,E21)","v":"00"},null,null,null,1,2,{"$f":"IF(J22=1,1,0)","v":0},null,null,"ACM",0.25,{"$f":"IF(Margenkalk!C19<100000,E23-(Matrix!E23*Matrix!O22),Matrix!E23)","v":{"$error":"#N/A"}}]
[16,0.26,null,"Gewinnbedarf",{"$f":"VLOOKUP(E19,O4:P14,2,FALSE)+IF(Margenkalk!C19<25000,P15,IF(Margenkalk!C19<50000,P16,0))","v":{"$error":"#N/A"}},null,null,null,"Leasing - FPO",1,"vorschüssig",null,null,"KACM/Leiter Vertrieb/Leiter VI",0.5,{"$f":"E23-(E23*O23)","v":{"$error":"#N/A"}}]
[17,0.28000000000000003,null,"Unterschreitung",{"$f":"IF(Margenkalk!C28=\"\",Margenkalk!C27-Margenkalk!C33,Margenkalk!C29-Margenkalk!C33)*100","v":{"$error":"#VALUE!"}},null,null,null,"Leasing - RW",0,"nachschüssig",null,null,"Geschäftsleitung"]
[18,0.3,null,null,null,null,null,null,"Mietkauf",null,null,null,null,"Pouvoir",{"$f":"IF(E23-E24>=P21,\"VI\",IF(E23-E24>=P22,\"ACM\",IF(E23-E24>=P23,\"KACM/Leiter Vertrieb/Leiter VI\",\"Geschäftsleitung\")))","v":{"$error":"#N/A"}}]
[19,0.3]
[20,0.3,null,"Die Periodizität wurde bewusst nicht eingebaut, da sie für die DB-Berechnung in der EBV lt. Herrn Mischka nicht relevant ist!"]
[]
[null,null,null,1,2,3,4,5,6,7,8,9,10,11,12,13,14]
["Bonität","k<30t; m<200t; g 200t+","Besicherung in %","Schlüssel","Marge ohne Li","Marge SPK","Marge EBV",null,"2 Jahre","3 Jahre","4 Jahre","5 Jahre","6 Jahre","7 Jahre","8 Jahre","9 Jahre","10 Jahre"]
[1,"k",0,{"$f":"CONCATENATE(A31,B31,C31)","v":"1k0"},1,0.3,{"$f":"E31-F31","v":0.7},null,{"$f":"Precalculation!D61","v":0.13},{"$f":"Precalculation!D62","v":0.14499999999999999},{"$f":"Precalculation!D63","v":0.15999999999999998},{"$f":"Precalculation!D64","v":0.17499999999999999},{"$f":"Precalculation!D65","v":0.18999999999999997},{"$f":"Precalculation!D66","v":0.20499999999999996},{"$f":"Precalculation!D67","v":0.21999999999999997},{"$f":"Precalculation!D68","v":0.23499999999999996},{"$f":"Precalculation!D69","v":0.24999999999999994}]
[2,"k",0,{"$f":"CONCATENATE(A32,B32,C32)","v":"2k0"},1.03,0.35,{"$f":"E32-F32","v":0.68},null,{"$f":"Precalculation!E61","v":0.24999999999999997},{"$f":"Precalculation!E62","v":0.26499999999999996},{"$f":"Precalculation!E63","v":0.27999999999999997},{"$f":"Precalculation!E64","v":0.29499999999999998},{"$f":"Precalculation!E65","v":0.31},{"$f":"Precalculation!E66","v":0.32500000000000001},{"$f":"Precalculation!E67","v":0.34},{"$f":"Precalculation!E68","v":0.35500000000000004},{"$f":"Precalculation!E69","v":0.37000000000000005}]
[3,"k",0,"3k0",1.04,0.4,0.64,null,{"$f":"Precalculation!F61","v":0.4},{"$f":"Precalculation!F62","v":0.41875000000000001},{"$f":"Precalculation!F63","v":0.4375},{"$f":"Precalculation!F64","v":0.45625000000000004},{"$f":"Precalculation!F65","v":0.47500000000000003},{"$f":"Precalculation!F66","v":0.49375000000000002},{"$f":"Precalculation!F67","v":0.51250000000000007},{"$f":"Precalculation!F68","v":0.53125},{"$f":"Precalculation!F69","v":0.55000000000000004}]
["4a","k",0,"4ak0",1.65,0.55000000000000004,1.0999999999999999,null,{"$f":"Precalculation!G61","v":0.53},{"$f":"Precalculation!G62","v":0.55249999999999999},{"$f":"Precalculation!G63","v":0.57499999999999996},{"$f":"Precalculation!G64","v":0.59749999999999992},{"$f":"Precalculation!G65","v":0.62},{"$f":"Precalculation!G66","v":0.64250000000000007},{"$f":"Precalculation!G67","v":0.66500000000000004},{"$f":"Precalculation!G68","v":0.6875},{"$f":"Precalculation!G69","v":0.71}]
["4b","k",0,"4bk0",1.8,0.7,1.1000000000000001,null,{"$f":"Precalculation!H61","v":0.68},{"$f":"Precalculation!H62","v":0.70250000000000012},{"$f":"Precalculation!H63","v":0.72500000000000009},{"$f":"Precalculation!H64","v":0.74750000000000005},{"$f":"Precalculation!H65","v":0.77},{"$f":"Precalculation!H66","v":0.79249999999999998},{"$f":"Precalculation!H67","v":0.81500000000000006},{"$f":"Precalculation!H68","v":0.83750000000000013},{"$f":"Precalculation!H69","v":0.8600000000000001}]
["4c","k",0,"4ck0",2,0.9,1.1000000000000001,null,{"$f":"Precalculation!I61","v":0.76},{"$f":"Precalculation!I62","v":0.78875000000000006},{"$f":"Precalculation!I63","v":0.8175},{"$f":"Precalculation!I64","v":0.84624999999999995},{"$f":"Precalculation!I65","v":0.875},{"$f":"Precalculation!I66","v":0.90375000000000005},{"$f":"Precalculation!I67","v":0.9325},{"$f":"Precalculation!I68","v":0.96124999999999994},{"$f":"Precalculation!I69","v":0.99}]
["5a","k",0,"5ak0",2.1800000000000002,1.05,1.1300000000000001,null,{"$f":"Precalculation!J61","v":1.0799999999999998},{"$f":"Precalculation!J62","v":1.105},{"$f":"Precalculation!J63","v":1.1299999999999999},{"$f":"Precalculation!J64","v":1.1549999999999998},{"$f":"Precalculation!J65","v":1.18},{"$f":"Precalculation!J66","v":1.2050000000000001},{"$f":"Precalculation!J67","v":1.23},{"$f":"Precalculation!J68","v":1.2549999999999999},{"$f":"Precalculation!J69","v":1.28}]
["5b","k",0,"5bk0",2.33,1.2,1.1300000000000001,null,{"$f":"Precalculation!K61","v":1.42},{"$f":"Precalculation!K62","v":1.44},{"$f":"Precalculation!K63","v":1.46},{"$f":"Precalculation!K64","v":1.48},{"$f":"Precalculation!K65","v":1.5},{"$f":"Precalculation!K66","v":1.52},{"$f":"Precalculation!K67","v":1.54},{"$f":"Precalculation!K68","v":1.56},{"$f":"Precalculation!K69","v":1.58}]
["5c","k",0,"5ck0",2.5299999999999998,1.4,1.1299999999999999,null,{"$f":"Precalculation!L61","v":1.92},{"$f":"Precalculation!L62","v":1.9275},{"$f":"Precalculation!L63","v":1.9350000000000001},{"$f":"Precalculation!L64","v":1.9424999999999999},{"$f":"Precalculation!L65","v":1.95},{"$f":"Precalculation!L66","v":1.9575},{"$f":"Precalculation!L67","v":1.9649999999999999},{"$f":"Precalculation!L68","v":1.9724999999999999},{"$f":"Precalculation!L69","v":1.98}]
["6a","k",0,"6ak0",3.03,1.8,1.2299999999999998,null,{"$f":"Precalculation!M61","v":3.07},{"$f":"Precalculation!M62","v":3.03125},{"$f":"Precalculation!M63","v":2.9924999999999997},{"$f":"Precalculation!M64","v":2.9537499999999999},{"$f":"Precalculation!M65","v":2.915},{"$f":"Precalculation!M66","v":2.8762500000000002},{"$f":"Precalculation!M67","v":2.8375000000000004},{"$f":"Precalculation!M68","v":2.7987500000000001},{"$f":"Precalculation!M69","v":2.7600000000000002}]
{"$rows_left_out":183}
{"sheet":"Precalculation","index":2,"n_rows":69,"n_cols":16,"rows_kept":69,"cut":false,"hidden":true,"merged":[[4,1,4,3]]}
["Berechnung der Marge lt. Precalculatio-Tool: Annahmen: Österreich, < 50 Mio., Holding, 3 Months, EUR, non revolving loan, No LEA, monthly principal, austria -CORPALL, Value of Collateral for SRC/ERM = 70, 50, 20, 0% Value of Collateral for RWA imme 0%"]
["Ergebnis ist:","VOLUMSUNABHÄNGIG und über Laufzeit bei gleicher Bonität zw. 2 und 10 Jahren annähernd linear"]
[]
[]
["STAND:","Precalculation_201401"]
[]
[]
["70% Sicherheit",null,"Li-Kosten",1,2,3,"4a","4b","4c","5a","5b","5c","6a","6b",7,8]
["Erfassung der EVA Marge lt. Tool","LZ 2 Jahre",0.1,0.22,0.33,0.44,0.55000000000000004,0.67,0.73,0.93,1.1100000000000001,1.36,1.9,2.31,3.84,7.23]
["inkl. Li-Kosten","LZ 10 Jahre",0.44,0.61,0.72,0.85,0.97,1.0900000000000001,1.1599999999999999,1.35,1.53,1.73,2.14,2.52,3.55,5.82]
[]
["Aufschläge lt. Precalculatio-Tool ohne Li-Kosten",null,"Laufzeit",1,2,3,"4a","4b","4c","5a","5b","5c","6a","6b",7,8]
[null,null,2,{"$f":"D9-$C$9","v":0.12},0.23,0.33999999999999997,0.45000000000000007,0.57000000000000006,0.63,0.83000000000000007,1.01,1.26,1.7999999999999998,2.21,3.7399999999999998,7.1300000000000008]
[null,null,3,{"$f":"(D13+D15)/2","v":0.12625},{"$f":"(E13+E15)/2","v":0.23625000000000002},0.34875,0.46000000000000008,0.58000000000000007,0.6412500000000001,0.84000000000000008,1.02,1.2637499999999999,1.7874999999999999,2.1937500000000001,3.6612499999999999,6.9112500000000008]
[null,null,4,{"$f":"(D17+D13)/2","v":0.13250000000000001},{"$f":"(E17+E13)/2","v":0.24249999999999999},0.35749999999999998,0.47000000000000008,0.59000000000000008,0.65250000000000008,0.85000000000000009,1.03,1.2675000000000001,1.7749999999999999,2.1775000000000002,3.5824999999999996,6.6925000000000008]
[null,null,5,{"$f":"(D15+D17)/2","v":0.13874999999999998},{"$f":"(E15+E17)/2","v":0.24875},0.36624999999999996,0.48000000000000009,0.60000000000000009,0.66375000000000006,0.8600000000000001,1.04,1.27125,1.7625,2.1612499999999999,3.5037499999999997,6.4737500000000008]
[null,null,6,{"$f":"(D13+D21)/2","v":0.14499999999999999},{"$f":"(E13+E21)/2","v":0.255},0.375,0.49000000000000005,0.6100000000000001,0.67500000000000004,0.87000000000000011,1.05,1.2749999999999999,1.75,2.145,3.4249999999999998,6.2550000000000008]
[null,null,7,{"$f":"(D17+D19)/2","v":0.15125},{"$f":"(E17+E19)/2","v":0.26124999999999998},0.38374999999999998,0.5,0.62000000000000011,0.68625000000000003,0.88000000000000012,1.06,1.2787500000000001,1.7375,2.1287500000000001,3.3462499999999999,6.0362500000000008]
[null,null,8,{"$f":"(D21+D17)/2","v":0.15749999999999997},{"$f":"(E21+E17)/2","v":0.26749999999999996},0.39249999999999996,0.51,0.63000000000000012,0.69750000000000001,0.89000000000000012,1.07,1.2825,1.7250000000000001,2.1124999999999998,3.2675000000000001,5.8175000000000008]
[null,null,9,{"$f":"(D19+D21)/2","v":0.16374999999999998},{"$f":"(E19+E21)/2","v":0.27374999999999994},0.40125,0.52,0.64000000000000012,0.70874999999999999,0.90000000000000013,1.08,1.2862499999999999,1.7125000000000001,2.0962499999999999,3.1887499999999998,5.5987500000000008]
[null,null,10,{"$f":"D10-$C$10","v":0.16999999999999998},{"$f":"E10-$C$10","v":0.27999999999999997},0.41,0.53,0.65000000000000013,0.72,0.91000000000000014,1.0900000000000001,1.29,1.7000000000000002,2.08,3.11,5.38]
[]
[]
["50% Sicherheit",null,{"$f":"C8","v":"Li-Kosten"},1,2,3,"4a","4b","4c","5a","5b","5c","6a","6b",7,8]
["Erfassung der EVA Marge lt. Tool","LZ 2 Jahre",{"$f":"C9","v":0.1},0.22,0.34,0.46,0.56999999999999995,0.7,0.77,1,1.23,1.54,2.2599999999999998,2.77,4.93,9.92]
["inkl. Li-Kosten","LZ 10 Jahre",{"$f":"C10","v":0.44},0.63,0.75,0.89,1.02,1.1499999999999999,1.24,1.45,1.67,1.93,2.44,2.91,4.3,7.59]
[]
["Aufschläge lt. Precalculatio-Tool ohne Li-Kosten",null,"Laufzeit",1,2,3,"4a","4b","4c","5a","5b","5c","6a","6b",7,8]
[null,null,2,{"$f":"D25-$C$9","v":0.12},0.24000000000000002,0.36,0.47,0.6,0.67,0.9,1.1299999999999999,1.44,2.1599999999999997,2.67,4.83,9.82]
[null,null,3,{"$f":"(D29+D31)/2","v":0.12875},0.24875000000000003,0.37124999999999997,0.48375000000000001,0.61375000000000002,0.68625000000000003,0.91375000000000006,1.1424999999999998,1.44625,2.1399999999999997,2.645,4.7087500000000002,9.4862500000000001]
[null,null,4,{"$f":"(D33+D29)/2","v":0.13750000000000001},{"$f":"(E33+E29)/2","v":0.25750000000000001},0.38250000000000001,0.4975,0.62749999999999995,0.70250000000000012,0.92749999999999999,1.1549999999999998,1.4524999999999999,2.12,2.62,4.5875000000000004,9.1524999999999999]
[null,null,5,{"$f":"(D31+D33)/2","v":0.14624999999999999},0.26624999999999999,0.39375000000000004,0.51124999999999998,0.64124999999999999,0.71875000000000011,0.94125000000000003,1.1675,1.4587499999999998,2.1,2.5950000000000002,4.4662500000000005,8.8187499999999996]
[null,null,6,{"$f":"(D29+D37)/2","v":0.155},{"$f":"(E29+E37)/2","v":0.27500000000000002},0.40500000000000003,0.52500000000000002,{"$f":"(H29+H37)/2","v":0.65500000000000003},0.7350000000000001,0.95500000000000007,1.18,1.4649999999999999,2.08,2.5700000000000003,4.3449999999999998,8.4849999999999994]
[null,null,7,{"$f":"(D33+D35)/2","v":0.16375000000000001},0.28375,0.41625000000000001,0.53875000000000006,0.66874999999999996,0.75125000000000008,0.96875,1.1924999999999999,1.4712499999999999,2.06,2.5450000000000004,4.2237499999999999,8.1512499999999992]
[null,null,8,{"$f":"(D37+D33)/2","v":0.17249999999999999},{"$f":"(E37+E33)/2","v":0.29249999999999998},0.42749999999999999,0.55249999999999999,0.6825,0.76750000000000007,0.98250000000000004,1.2050000000000001,1.4775,2.04,2.5200000000000005,4.1025,7.817499999999999]
[null,null,9,{"$f":"(D35+D37)/2","v":0.18124999999999999},0.30125000000000002,0.43874999999999997,0.56625000000000003,0.69625000000000004,0.78375000000000006,0.99625000000000008,1.2175,1.4837500000000001,2.02,2.4950000000000001,3.9812500000000002,7.4837499999999988]
[null,null,10,{"$f":"D26-$C$10","v":0.19},0.31,0.45,0.58000000000000007,0.71,0.8,1.01,1.23,1.49,2,2.4700000000000002,3.86,7.1499999999999995]
[]
[]
["20% Sicherheit",null,{"$f":"C24","v":"Li-Kosten"},1,2,3,"4a","4b","4c","5a","5b","5c","6a","6b",7,8]
{"$rows_left_out":30}
{"sheet":"Interne Li-Kosten","index":3,"n_rows":185,"n_cols":11,"rows_kept":185,"cut":false,"hidden":false,"merged":[[2,4,2,7],[0,4,0,7]]}
[{"$f":"\"Liqui-Aufschläge \"&K2&\"/\"&J2","v":"Liqui-Aufschläge 01/2025"},null,null,null,"INTERNE KALKULATION",null,null,null,null,"Jahr","Monat"]
["Verw-Aufschlag",null,0,null,null,null,null,null,null,2025,"01"]
["Basis lt. EB",null,"incl. Verw-A",null,"Umrechnung für tilgende Werte"]
[null,"AUT","AUT",null,"Monate","Endfällig","Tilgend","Differenz"]
["O/N",0,{"$f":"B5+$C$2","v":0},null,0,{"$f":"C5","v":0},{"$f":"C5","v":0},{"$f":"F5-G5","v":0}]
["1m",0,0,null,1,{"$f":"C6","v":0},{"$f":"VLOOKUP(ROUNDUP(E6*0.6,0),$E$6:$F$185,2)","v":0},0]
["2m",0,0,null,2,0,0,0]
["3m",0,0,null,3,0,0,0]
["4m",0,0,null,4,0,0,0]
["5m",0,0,null,5,0,0,0]
["6m",0,0,null,6,0,0,0]
["7m",2,2,null,7,2,0,2]
["8m",4,4,null,8,4,0,4]
["9m",6,6,null,9,6,0,6]
["10m",8,8,null,10,8,0,8]
["11m",9,9,null,11,9,2,7]
["1y",11,{"$f":"B17+$C$2","v":11},null,12,11,4,7]
["13m",1,{"$f":"B18+$C$2","v":1},null,13,1,4,-3]
["14m",3,{"$f":"B19+$C$2","v":3},null,14,3,6,-3]
["15m",3.9999999999999996,3.9999999999999996,null,15,3.9999999999999996,6,-2.0000000000000004]
["16m",6,6,null,16,6,8,-2]
["17m",7.0000000000000009,7.0000000000000009,null,17,7.0000000000000009,9,-1.9999999999999991]
["18m",9,9,null,18,9,9,0]
["19m",9,9,null,19,9,11,-2]
["20m",10,10,null,20,10,11,-1]
["21m",12.000000000000002,12.000000000000002,null,21,12.000000000000002,1,11.000000000000002]
["22m",13,13,null,22,13,3,10]
["23m",15,{"$f":"B28+$C$2","v":15},null,23,15,3,12]
["2y",16,16,null,24,16,3.9999999999999996,12]
["3y",24,24,null,25,{"$f":"F41","v":24},3.9999999999999996,20]
["4y",35,35,null,26,{"$f":"F41","v":24},6,18]
["5y",45,45,null,27,{"$f":"F41","v":24},7.0000000000000009,17]
["6y",55.999999999999993,55.999999999999993,null,28,{"$f":"F41","v":24},7.0000000000000009,17]
["7y",62,62,null,29,{"$f":"F41","v":24},9,15]
["8y",65.999999999999986,65.999999999999986,null,30,{"$f":"F41","v":24},9,15]
["9y",71,71,null,31,{"$f":"F41","v":24},9,15]
["10y",76,76,null,32,{"$f":"F41","v":24},10,14]
["15y",88,88,null,33,{"$f":"F41","v":24},10,14]
["20y",98.000000000000014,98.000000000000014,null,34,{"$f":"F41","v":24},12.000000000000002,11.999999999999998]
["25y",107,107,null,35,{"$f":"F41","v":24},12.000000000000002,11.999999999999998]
{"$rows_left_out":145}